Try to deploy documentation to S3

9 jobs for master in 11 minutes and 35 seconds (queued for 3 seconds)
Status Job ID Name Coverage
  Test
failed #6313
autoscale-linux
linux

00:11:34

passed #6311
xcode8 openswift atbuild atpm
osx

00:00:09

failed #6312
xcode8 openswift atbuild atpm
osxxcode

00:00:08

 
  Package
skipped #6314
autoscale-linux
documentation
skipped #6318
xcode8 openswift atbuild package-framework atpm
ioscorepackage
skipped #6317
autoscale-linux
linuxtoolpackage
skipped #6315
xcode8 openswift atbuild package-framework atpm
osxcorepackage
skipped #6316
xcode8 openswift atbuild package-homebrew atpm
osxtoolpackage
 
  Deploy
manual #6319
allowed to fail manual
deploydocs
 
Name Stage Failure
failed
linux Test There is an unknown failure, please try again
Get:10 https://packagecloud.io jessie/main Sources [20 B]
Get:11 https://packagecloud.io jessie/main amd64 Packages [769 B]
Get:12 http://httpredir.debian.org jessie-updates/main amd64 Packages [17.6 kB]
Get:13 http://httpredir.debian.org jessie/main amd64 Packages [9064 kB]
Fetched 9878 kB in 4min 26s (37.1 kB/s)
Reading package lists...
$ apt-get install atbuild atpm -y
Reading package lists.../bin/bash: line 46: 40 Terminated apt-get install atbuild atpm -y
ERROR: Build failed: exit code 1
failed
osxxcode Test There is an unknown failure, please try again
       ^
tests/CoreTests/assert.swift:15:8: error: no such module 'CarolineCore'
import CarolineCore
^
tests/CoreTests/assert.swift:15:8: error: no such module 'CarolineCore'
import CarolineCore
^
<unknown>:0: error: build had 1 command failures
ERROR: Build failed: exit status 1