Xcode 8 GM

10 jobs for master in 33 minutes and 17 seconds (queued for 1 second)
Status Job ID Name Coverage
  Test
passed #5693
autoscale-linux
linux

00:01:43

failed #5700
openswift atbuild atpm xcode8
osx

00:00:03

failed #5699
openswift atbuild atpm xcode8
osxxcode

00:00:12

failed #5691
xcode8 openswift atbuild atpm
osx

00:00:00

failed #5692
xcode8 openswift atbuild atpm
osxxcode

00:00:00

 
  Package
skipped #5694
autoscale-linux
documentation
skipped #5698
xcode8 openswift atbuild package-framework atpm
ioscorepackage
skipped #5697
autoscale-linux
linuxtoolpackage
skipped #5695
xcode8 openswift atbuild package-framework atpm
osxcorepackage
skipped #5696
xcode8 openswift atbuild package-homebrew atpm
osxtoolpackage
 
Name Stage Failure
failed
osxxcode Test There is an unknown failure, please try again
<unknown>:0: warning: no such SDK: '/Applications/Xcode-beta.app/Contents/Developer/Platforms/MacOSX.platform/Developer/SDKs/MacOSX.sdk'
<unknown>:0: warning: no such sysroot directory: '/Applications/Xcode-beta.app/Contents/Developer/Platforms/MacOSX.platform/Developer/SDKs/MacOSX.sdk'
external/StandBack/src/StandBack.swift:21:8: error: cannot load underlying module for 'Darwin'
import Darwin
^
<unknown>:0: error: build had 1 command failures
fatal error: process /Library/Developer/Toolchains/swift-latest.xctoolchain/usr/bin/swift-build-tool -f .atllbuild/llbuild.yaml error 1: file attools/src/Tools.swift, line 139
bash: line 42: 74544 Illegal instruction: 4 atbuild coretest-gen
ERROR: Build failed: exit status 1
failed
osx Test There is an unknown failure, please try again
       ^
<unknown>:0: warning: no such sysroot directory: '/Applications/Xcode-beta.app/Contents/Developer/Platforms/MacOSX.platform/Developer/SDKs/MacOSX.sdk'
CarolineCore/CarolineCore.swift:16:8: error: cannot load underlying module for 'Darwin'
import Darwin
^
<unknown>:0: error: build had 1 command failures
fatal error: process /Library/Developer/Toolchains/swift-latest.xctoolchain/usr/bin/swift-build-tool -f .atllbuild/llbuild.yaml error 1: file attools/src/Tools.swift, line 139
bash: line 42: 74623 Illegal instruction: 4 atbuild check
ERROR: Build failed: exit status 1