Upgrade to Swift Preview 6

2 jobs for swift-preview-6 in 38 seconds (queued for 2 seconds)
Status Job ID Name Coverage
  Build
failed #5006
autoscale-linux
linux

00:00:28

failed #5007
openswift
osx

00:00:10

 
Name Stage Failure
failed
osx Build There is an unknown failure, please try again
atpkg/atfoundation/src/date/date.swift:18:12: error: cannot load underlying module for 'Darwin'
import Darwin
^
<unknown>:0: warning: no such sysroot directory: '/Applications/Xcode-beta.app/Contents/Developer/Platforms/MacOSX.platform/Developer/SDKs/MacOSX.sdk'
atpkg/atfoundation/src/date/date.swift:18:12: error: cannot load underlying module for 'Darwin'
import Darwin
^
<unknown>:0: error: build had 1 command failures
ERROR: Build failed: exit status 1
failed
linux Build There is an unknown failure, please try again
35 libc.so.6       0x00007ff3075c2b45 __libc_start_main + 245
36 swift 0x00000000007e0ab6
Stack dump:
0. Program arguments: /usr/local/bin/swift -frontend -c atpkg/atfoundation/src/charset.swift atpkg/atfoundation/src/date/date.swift atpkg/atfoundation/src/date/timeinterval.swift atpkg/atfoundation/src/filesystem/file.swift atpkg/atfoundation/src/filesystem/fileinfo.swift atpkg/atfoundation/src/filesystem/fs.swift atpkg/atfoundation/src/filesystem/path.swift -primary-file atpkg/atfoundation/src/logger.swift atpkg/atfoundation/src/string/replace.swift atpkg/atfoundation/src/string/search.swift atpkg/atfoundation/src/string/split.swift atpkg/atfoundation/src/string/substring.swift atpkg/atfoundation/src/string/whitespace.swift atpkg/atfoundation/src/string.swift atpkg/atfoundation/src/syserror.swift atpkg/atfoundation/src/tools.swift atpkg/atfoundation/src/url.swift -target x86_64-unknown-linux-gnu -disable-objc-interop -I .atllbuild/products/ -enable-testing -g -D ATBUILD -D ATBUILD_DEBUG -Xcc -D_GNU_SOURCE -emit-module-doc-path .atllbuild/llbuildtmp/logger~partial.swiftdoc -parse-as-library -module-name atfoundation -emit-module-path .atllbuild/llbuildtmp/logger~partial.swiftmodule -emit-dependencies-path .atllbuild/llbuildtmp/logger.d -emit-reference-dependencies-path .atllbuild/llbuildtmp/logger.swiftdeps -num-threads 8 -o .atllbuild/objects/logger.swift.o
1. While type-checking 'log' at atpkg/atfoundation/src/logger.swift:106:12
2. While type-checking expression at [atpkg/atfoundation/src/logger.swift:116:13 - line:116:64] RangeText="self._fwrite(stderr, String(describing: item) + " ")"
<unknown>:0: error: unable to execute command: Aborted
<unknown>:0: error: compile command failed due to signal (use -v to see invocation)
ERROR: Build failed: exit code 1