Make it compile in snapshot 04-12

2 jobs for swift3-parameter-renaming
Status Job ID Name Coverage
  Build
failed #2813
docker
linux

00:00:14

failed #2814
openswift
osx

00:00:02

 
Name Stage Failure
failed
linux Build There is an unknown failure, please try again
                                              
atpkg/src/Substitutions.swift:81:55: error: extraneous argument label 'substitution:' in call
output += evaluateSubstitution(substitution: currentSubstitionName, package: package)
^~~~~~~~~~~~~~~

<unknown>:0: error: build had 1 command failures
The command '/bin/sh -c bootstrap/build.sh linux' returned a non-zero code: 1

ERROR: Build failed: exit status 1
failed
osx Build There is an unknown failure, please try again
                                             ^~~~~~~~~~~~~~~~~~~~~

atpkg/src/Substitutions.swift:81:55: error: extraneous argument label 'substitution:' in call
output += evaluateSubstitution(substitution: currentSubstitionName, package: package)
^~~~~~~~~~~~~~~

<unknown>:0: error: build had 1 command failures

ERROR: Build failed: exit status 1